Reaction Details
TargetD(3) dopamine receptor
LigandBDBM50253552
Substrate/Competitorn/a
Meas. Tech.ChEMBL_538661 (CHEMBL1033059)
Ki 31±n/a nM
Citation Paul, NMTaylor, MKumar, RDeschamps, JRLuedtke, RRNewman, AH Structure-activity relationships for a novel series of dopamine D2-like receptor ligands based on N-substituted 3-aryl-8-azabicyclo[3.2.1]octan-3-ol. J Med Chem51:6095-109 (2008) 
 
D(3) dopamine receptor
Name:D(3) dopamine receptor
Type:n/a
Mol. Mass.:44243.43
Organism:Homo sapiens (Human)
Description:n/a
Residue:400
BDBM50253552
NameBDBM50253552
Synonyms:CHEMBL494115 | endo-8-(1H-Indol-3-ylmethyl)-3-(4-fluorophenyl)-8-azabicyclo[3.2.1]octan-3-ol
TypeSmall organic molecule
Emp. Form.C22H23FN2O
Mol. Mass.350.4292
SMILESOC1(CC2CCC(C1)N2Cc1c[nH]c2ccccc12)c1ccc(F)cc1