Reaction Details
TargetIntegrin alpha-L
LigandBDBM50263599
Substrate/Competitorn/a
Meas. Tech.ChEMBL_535592 (CHEMBL987066)
IC50 45±n/a nM
Citation Guckian, KMLin, EYSilvian, LFriedman, JEChin, DScott, DM Design and synthesis of a series of meta aniline-based LFA-1 ICAM inhibitors. Bioorg Med Chem Lett18:5249-51 (2008) 
 
Integrin alpha-L
Name:Integrin alpha-L
Type:PROTEIN
Mol. Mass.:128748.90
Organism:Homo sapiens (Human)
Description:ChEMBL_629045
Residue:1170
BDBM50263599
NameBDBM50263599
Synonyms:(E)-3-(4-(3-(cyclopentylamino)phenylthio)-2,3-bis(trifluoromethyl)phenyl)-1-morpholinoprop-2-en-1-one | CHEMBL515964
TypeSmall organic molecule
Emp. Form.C26H26F6N2O2S
Mol. Mass.544.552
SMILESFC(F)(F)c1c(Sc2cccc(NC3CCCC3)c2)ccc(\C=C\C(=O)N2CCOCC2)c1C(F)(F)F