Reaction Details
TargetIntegrin alpha-L
LigandBDBM50263709
Substrate/Competitorn/a
Meas. Tech.ChEMBL_535592 (CHEMBL987066)
IC50 3.2±n/a nM
Citation Guckian, KMLin, EYSilvian, LFriedman, JEChin, DScott, DM Design and synthesis of a series of meta aniline-based LFA-1 ICAM inhibitors. Bioorg Med Chem Lett18:5249-51 (2008) 
 
Integrin alpha-L
Name:Integrin alpha-L
Type:PROTEIN
Mol. Mass.:128748.90
Organism:Homo sapiens (Human)
Description:ChEMBL_629045
Residue:1170
BDBM50263709
NameBDBM50263709
Synonyms:(cis)-4-((3-(4-((E)-3-morpholino-3-oxoprop-1-enyl)-2,3-bis(trifluoromethyl)phenylthio)phenylamino)methyl)cyclohexanecarboxylic acid | CHEMBL500859
TypeSmall organic molecule
Emp. Form.C29H30F6N2O4S
Mol. Mass.616.615
SMILESOC(=O)[C@@H]1CC[C@H](CNc2cccc(Sc3ccc(\C=C\C(=O)N4CCOCC4)c(c3C(F)(F)F)C(F)(F)F)c2)CC1