Reaction Details
TargetOxytocin receptor
LigandBDBM50263856
Substrate/Competitorn/a
Meas. Tech.ChEMBL_535596 (CHEMBL987070)
Ki 28±n/a nM
Citation Brown, ABrown, LBrown, TBCalabrese, AEllis, DPuhalo, NSmith, CRWallace, OWatson, L Triazole oxytocin antagonists: identification of aryl ether replacements for a biaryl substituent. Bioorg Med Chem Lett18:5242-4 (2008) 
 
Oxytocin receptor
Name:Oxytocin receptor
Type:Enzyme Catalytic Domain
Mol. Mass.:42793.26
Organism:Homo sapiens (Human)
Description:Oxytocin OXTR HEK293::B2R9L7
Residue:389
BDBM50263856
NameBDBM50263856
Synonyms:5-(3-(4-ethoxy-3-methylphenyl)-5-(ethoxymethyl)-4H-1,2,4-triazol-4-yl)-2-methoxypyridine | CHEMBL492029
TypeSmall organic molecule
Emp. Form.C20H24N4O3
Mol. Mass.368.4296
SMILESCCOCc1nnc(-c2ccc(OCC)c(C)c2)n1-c1ccc(OC)nc1