Reaction Details
TargetMelatonin receptor type 1B
LigandBDBM50035179
Substrate/Competitorn/a
Meas. Tech.ChEMBL_535636 (CHEMBL987964)
Ki 0.27±n/a nM
Citation Poissonnier-Durieux, SEttaoussi, MPérès, BBoutin, JAAudinot, VBennejean, CDelagrange, PCaignard, DHRenard, PBerthelot, PLesieur, DYous, S Synthesis of 3-phenylnaphthalenic derivatives as new selective MT(2) melatoninergic ligands. Bioorg Med Chem16:8339-48 (2008) 
 
Melatonin receptor type 1B
Name:Melatonin receptor type 1B
Type:Enzyme
Mol. Mass.:40203.54
Organism:Homo sapiens (Human)
Description:P49286
Residue:362
BDBM50035179
NameBDBM50035179
Synonyms:Agomelatine N-[2-(7-Methoxy-naphthalen-1-yl)-ethyl]-acetamide S 20098 US11091445, Compound code IA2-76
TypeSmall organic molecule
Emp. Form.C15H17NO2
Mol. Mass.243.301
SMILESCOc1ccc2cccc(CCNC(C)=O)c2c1