Reaction Details
TargetIntegrin alpha-L
LigandBDBM50265106
Substrate/Competitorn/a
Meas. Tech.ChEMBL_497066 (CHEMBL997702)
IC50 8.9±n/a nM
Citation Lin, EYGuckian, KMSilvian, LChin, DBoriack-Sjodin, PAvan Vlijmen, HFriedman, JEScott, DM Structure-activity relationship of ortho- and meta-phenol based LFA-1 ICAM inhibitors. Bioorg Med Chem Lett18:5245-8 (2008) 
 
Integrin alpha-L
Name:Integrin alpha-L
Type:PROTEIN
Mol. Mass.:128748.90
Organism:Homo sapiens (Human)
Description:ChEMBL_629045
Residue:1170
BDBM50265106
NameBDBM50265106
Synonyms:(E)-3-(4-(2-(cyclohexyloxy)phenylthio)-2,3-bis(trifluoromethyl)phenyl)-1-morpholinoprop-2-en-1-one | CHEMBL496314
TypeSmall organic molecule
Emp. Form.C27H27F6NO3S
Mol. Mass.559.564
SMILESFC(F)(F)c1c(Sc2ccccc2OC2CCCCC2)ccc(\C=C\C(=O)N2CCOCC2)c1C(F)(F)F