Reaction Details
TargetIntegrin alpha-L
LigandBDBM50265248
Substrate/Competitorn/a
Meas. Tech.ChEMBL_497066 (CHEMBL997702)
IC50 51±n/a nM
Citation Lin, EYGuckian, KMSilvian, LChin, DBoriack-Sjodin, PAvan Vlijmen, HFriedman, JEScott, DM Structure-activity relationship of ortho- and meta-phenol based LFA-1 ICAM inhibitors. Bioorg Med Chem Lett18:5245-8 (2008) 
 
Integrin alpha-L
Name:Integrin alpha-L
Type:PROTEIN
Mol. Mass.:128748.90
Organism:Homo sapiens (Human)
Description:ChEMBL_629045
Residue:1170
BDBM50265248
NameBDBM50265248
Synonyms:(E)-3-(4-(2-((trans)-4-methylcyclohexyloxy)phenylthio)-2,3-bis(trifluoromethyl)phenyl)-1-morpholinoprop-2-en-1-one | CHEMBL501977
TypeSmall organic molecule
Emp. Form.C28H29F6NO3S
Mol. Mass.573.59
SMILESC[C@H]1CC[C@@H](CC1)Oc1ccccc1Sc1ccc(\C=C\C(=O)N2CCOCC2)c(c1C(F)(F)F)C(F)(F)F