Reaction Details
TargetIntegrin alpha-L
LigandBDBM50264879
Substrate/Competitorn/a
Meas. Tech.ChEMBL_497066 (CHEMBL997702)
IC50 3.4±n/a nM
Citation Lin, EYGuckian, KMSilvian, LChin, DBoriack-Sjodin, PAvan Vlijmen, HFriedman, JEScott, DM Structure-activity relationship of ortho- and meta-phenol based LFA-1 ICAM inhibitors. Bioorg Med Chem Lett18:5245-8 (2008) 
 
Integrin alpha-L
Name:Integrin alpha-L
Type:PROTEIN
Mol. Mass.:128748.90
Organism:Homo sapiens (Human)
Description:ChEMBL_629045
Residue:1170
BDBM50264879
NameBDBM50264879
Synonyms:(cis)-4-((3-(4-((E)-3-morpholino-3-oxoprop-1-enyl)-2,3-bis(trifluoromethyl)phenylthio)phenoxy)methyl)cyclohexanecarboxylic acid | CHEMBL446300
TypeSmall organic molecule
Emp. Form.C29H29F6NO5S
Mol. Mass.617.6
SMILESOC(=O)[C@@H]1CC[C@H](COc2cccc(Sc3ccc(\C=C\C(=O)N4CCOCC4)c(c3C(F)(F)F)C(F)(F)F)c2)CC1