Reaction Details
Target1-deoxy-D-xylulose-5-phosphate synthase
LigandBDBM51305
Substrate/Competitorn/a
Meas. Tech.ChEMBL_535725 (CHEMBL989742)
IC50 23000±n/a nM
Citation Mao, JEoh, HHe, RWang, YWan, BFranzblau, SGCrick, DCKozikowski, AP Structure-activity relationships of compounds targeting mycobacterium tuberculosis 1-deoxy-D-xylulose 5-phosphate synthase. Bioorg Med Chem Lett18:5320-3 (2008) 
 
1-deoxy-D-xylulose-5-phosphate synthase
Name:1-deoxy-D-xylulose-5-phosphate synthase
Type:PROTEIN
Mol. Mass.:67882.02
Organism:Mycobacterium tuberculosis
Description:ChEMBL_1441273
Residue:638
BDBM51305
NameBDBM51305
Synonyms:3,5-diphenyl-2-(trifluoromethyl)-1H-pyrazolo[1,5-a]pyrimidin-7-one CHEMBL522946 SMR000456169 | cid_2810970
TypeSmall organic molecule
Emp. Form.C19H12F3N3O
Mol. Mass.355.3133
SMILESFC(F)(F)c1[nH]n2c(nc(cc2=O)-c2ccccc2)c1-c1ccccc1