Reaction Details
Target1-deoxy-D-xylulose-5-phosphate synthase
LigandBDBM50263874
Substrate/Competitorn/a
Meas. Tech.ChEMBL_535725 (CHEMBL989742)
IC50>200000±n/a nM
Citation Mao, JEoh, HHe, RWang, YWan, BFranzblau, SGCrick, DCKozikowski, AP Structure-activity relationships of compounds targeting mycobacterium tuberculosis 1-deoxy-D-xylulose 5-phosphate synthase. Bioorg Med Chem Lett18:5320-3 (2008) 
 
1-deoxy-D-xylulose-5-phosphate synthase
Name:1-deoxy-D-xylulose-5-phosphate synthase
Type:PROTEIN
Mol. Mass.:67882.02
Organism:Mycobacterium tuberculosis
Description:ChEMBL_1441273
Residue:638
BDBM50263874
NameBDBM50263874
Synonyms:CHEMBL1608283 | ethyl 2-(5-methyl-7-oxo-3-phenyl-4,7-dihydropyrazolo[1,5-a]pyrimidin-6-yl)acetate
TypeSmall organic molecule
Emp. Form.C17H17N3O3
Mol. Mass.311.3352
SMILESCCOC(=O)Cc1c(C)nc2c(cnn2c1O)-c1ccccc1