Reaction Details
Target1-deoxy-D-xylulose-5-phosphate synthase
LigandBDBM50263928
Substrate/Competitorn/a
Meas. Tech.ChEMBL_535725 (CHEMBL989742)
IC50>200000±n/a nM
Citation Mao, JEoh, HHe, RWang, YWan, BFranzblau, SGCrick, DCKozikowski, AP Structure-activity relationships of compounds targeting mycobacterium tuberculosis 1-deoxy-D-xylulose 5-phosphate synthase. Bioorg Med Chem Lett18:5320-3 (2008) 
 
1-deoxy-D-xylulose-5-phosphate synthase
Name:1-deoxy-D-xylulose-5-phosphate synthase
Type:PROTEIN
Mol. Mass.:67882.02
Organism:Mycobacterium tuberculosis
Description:ChEMBL_1441273
Residue:638
BDBM50263928
NameBDBM50263928
Synonyms:3-(4-bromophenyl)-5-methyl-2-(trifluoromethyl)pyrazolo[1,5-a]pyrimidin-7(4H)-one | CHEMBL523980
TypeSmall organic molecule
Emp. Form.C14H9BrF3N3O
Mol. Mass.372.14
SMILESCc1cc(=O)n2[nH]c(c(-c3ccc(Br)cc3)c2n1)C(F)(F)F