Reaction Details
Target1-deoxy-D-xylulose-5-phosphate synthase
LigandBDBM50264088
Substrate/Competitorn/a
Meas. Tech.ChEMBL_535725 (CHEMBL989742)
IC50 63700±n/a nM
Citation Mao, JEoh, HHe, RWang, YWan, BFranzblau, SGCrick, DCKozikowski, AP Structure-activity relationships of compounds targeting mycobacterium tuberculosis 1-deoxy-D-xylulose 5-phosphate synthase. Bioorg Med Chem Lett18:5320-3 (2008) 
 
1-deoxy-D-xylulose-5-phosphate synthase
Name:1-deoxy-D-xylulose-5-phosphate synthase
Type:PROTEIN
Mol. Mass.:67882.02
Organism:Mycobacterium tuberculosis
Description:ChEMBL_1441273
Residue:638
BDBM50264088
NameBDBM50264088
Synonyms:5-((4-chlorophenylthio)methyl)-2-methyl-3-phenylpyrazolo[1,5-a]pyrimidin-7(4H)-one | CHEMBL488964
TypeSmall organic molecule
Emp. Form.C20H16ClN3OS
Mol. Mass.381.879
SMILESCc1[nH]n2c(nc(CSc3ccc(Cl)cc3)cc2=O)c1-c1ccccc1