Reaction Details
Target1-deoxy-D-xylulose-5-phosphate synthase
LigandBDBM50264035
Substrate/Competitorn/a
Meas. Tech.ChEMBL_535725 (CHEMBL989742)
IC50 30600±n/a nM
Citation Mao, JEoh, HHe, RWang, YWan, BFranzblau, SGCrick, DCKozikowski, AP Structure-activity relationships of compounds targeting mycobacterium tuberculosis 1-deoxy-D-xylulose 5-phosphate synthase. Bioorg Med Chem Lett18:5320-3 (2008) 
 
1-deoxy-D-xylulose-5-phosphate synthase
Name:1-deoxy-D-xylulose-5-phosphate synthase
Type:PROTEIN
Mol. Mass.:67882.02
Organism:Mycobacterium tuberculosis
Description:ChEMBL_1441273
Residue:638
BDBM50264035
NameBDBM50264035
Synonyms:2-methyl-3,5-diphenylpyrazolo[1,5-a]pyrimidin-7(4H)-one | CHEMBL491211
TypeSmall organic molecule
Emp. Form.C19H15N3O
Mol. Mass.301.3419
SMILESCc1[nH]n2c(nc(cc2=O)-c2ccccc2)c1-c1ccccc1