Reaction Details
Target1-deoxy-D-xylulose-5-phosphate synthase
LigandBDBM50263972
Substrate/Competitorn/a
Meas. Tech.ChEMBL_535725 (CHEMBL989742)
IC50 10900±n/a nM
Citation Mao, JEoh, HHe, RWang, YWan, BFranzblau, SGCrick, DCKozikowski, AP Structure-activity relationships of compounds targeting mycobacterium tuberculosis 1-deoxy-D-xylulose 5-phosphate synthase. Bioorg Med Chem Lett18:5320-3 (2008) 
 
1-deoxy-D-xylulose-5-phosphate synthase
Name:1-deoxy-D-xylulose-5-phosphate synthase
Type:PROTEIN
Mol. Mass.:67882.02
Organism:Mycobacterium tuberculosis
Description:ChEMBL_1441273
Residue:638
BDBM50263972
NameBDBM50263972
Synonyms:3-(4-chlorophenyl)-5-(4-methoxyphenyl)-2-methylpyrazolo[1,5-a]pyrimidin-7(4H)-one | CHEMBL491607
TypeSmall organic molecule
Emp. Form.C20H16ClN3O2
Mol. Mass.365.813
SMILESCOc1ccc(cc1)-c1cc(=O)n2[nH]c(C)c(-c3ccc(Cl)cc3)c2n1