Reaction Details
TargetEstrogen receptor beta
LigandBDBM50253380
Substrate/Competitorn/a
Meas. Tech.ChEMBL_539658 (CHEMBL1028193)
Ki 299000±n/a nM
Citation Parent, AAGunther, JRKatzenellenbogen, JA Blocking estrogen signaling after the hormone: pyrimidine-core inhibitors of estrogen receptor-coactivator binding. J Med Chem51:6512-30 (2008) 
 
Estrogen receptor beta
Name:Estrogen receptor beta
Type:Protein
Mol. Mass.:59238.43
Organism:Homo sapiens (Human)
Description:Q92731
Residue:530
BDBM50253380
NameBDBM50253380
Synonyms:CHEMBL494706 | N,N,N-Triisobutyl-pyrimidine-2,4,6-triamine
TypeSmall organic molecule
Emp. Form.C16H31N5
Mol. Mass.293.4508
SMILESCC(C)CNc1cc(NCC(C)C)nc(NCC(C)C)n1