Reaction Details
TargetEstrogen receptor beta
LigandBDBM50253346
Substrate/Competitorn/a
Meas. Tech.ChEMBL_539658 (CHEMBL1028193)
Ki 132000±n/a nM
Citation Parent, AAGunther, JRKatzenellenbogen, JA Blocking estrogen signaling after the hormone: pyrimidine-core inhibitors of estrogen receptor-coactivator binding. J Med Chem51:6512-30 (2008) 
 
Estrogen receptor beta
Name:Estrogen receptor beta
Type:Protein
Mol. Mass.:59238.43
Organism:Homo sapiens (Human)
Description:Q92731
Residue:530
BDBM50253346
NameBDBM50253346
Synonyms:Benzyl-(2-isobutylamino-6-styryl-pyrimidin-4-yl)-carbamic acid tert-butyl ester | CHEMBL493501
TypeSmall organic molecule
Emp. Form.C28H34N4O2
Mol. Mass.458.5952
SMILESCC(C)CNc1nc(\C=C\c2ccccc2)cc(n1)N(Cc1ccccc1)C(=O)OC(C)(C)C