Reaction Details
TargetEstrogen receptor
LigandBDBM50253442
Substrate/Competitorn/a
Meas. Tech.ChEMBL_539657 (CHEMBL1028192)
Ki 2400±n/a nM
Citation Parent, AAGunther, JRKatzenellenbogen, JA Blocking estrogen signaling after the hormone: pyrimidine-core inhibitors of estrogen receptor-coactivator binding. J Med Chem51:6512-30 (2008) 
 
Estrogen receptor
Name:Estrogen receptor
Type:Protein
Mol. Mass.:66230.44
Organism:Homo sapiens (Human)
Description:P03372
Residue:595
BDBM50253442
NameBDBM50253442
Synonyms:CHEMBL494698 | N2-Isobutyl-6-(3-methyl-butyl)-N4-naphthalen-1-ylmethyl-pyrimidine-2,4-diamine
TypeSmall organic molecule
Emp. Form.C24H32N4
Mol. Mass.376.5377
SMILESCC(C)CCc1cc(NCc2cccc3ccccc23)nc(NCC(C)C)n1