Reaction Details
TargetEstrogen receptor
LigandBDBM50138883
Substrate/Competitorn/a
Meas. Tech.ChEMBL_539657 (CHEMBL1028192)
Ki 16000±n/a nM
Citation Parent, AAGunther, JRKatzenellenbogen, JA Blocking estrogen signaling after the hormone: pyrimidine-core inhibitors of estrogen receptor-coactivator binding. J Med Chem51:6512-30 (2008) 
 
Estrogen receptor
Name:Estrogen receptor
Type:Protein
Mol. Mass.:66230.44
Organism:Homo sapiens (Human)
Description:P03372
Residue:595
BDBM50138883
NameBDBM50138883
Synonyms:6-Butyl-N*2*,N*4*-dipropyl-pyrimidine-2,4-diamine CHEMBL352024
TypeSmall organic molecule
Emp. Form.C14H26N4
Mol. Mass.250.383
SMILESCCCCc1cc(NCCC)nc(NCCC)n1