Reaction Details
TargetEstrogen receptor
LigandBDBM50253351
Substrate/Competitorn/a
Meas. Tech.ChEMBL_539657 (CHEMBL1028192)
Ki 7600±n/a nM
Citation Parent, AAGunther, JRKatzenellenbogen, JA Blocking estrogen signaling after the hormone: pyrimidine-core inhibitors of estrogen receptor-coactivator binding. J Med Chem51:6512-30 (2008) 
 
Estrogen receptor
Name:Estrogen receptor
Type:Protein
Mol. Mass.:66230.44
Organism:Homo sapiens (Human)
Description:P03372
Residue:595
BDBM50253351
NameBDBM50253351
Synonyms:CHEMBL495135 | N2-Benzyl-N4-isobutyl-6-phenethyl-pyrimidine-2,4-diamine
TypeSmall organic molecule
Emp. Form.C23H28N4
Mol. Mass.360.4952
SMILESCC(C)CNc1cc(CCc2ccccc2)nc(NCc2ccccc2)n1