Reaction Details
TargetEstrogen receptor beta
LigandBDBM50138886
Substrate/Competitorn/a
Meas. Tech.ChEMBL_539661 (CHEMBL1028196)
Ki 2800±n/a nM
Citation Parent, AAGunther, JRKatzenellenbogen, JA Blocking estrogen signaling after the hormone: pyrimidine-core inhibitors of estrogen receptor-coactivator binding. J Med Chem51:6512-30 (2008) 
 
Estrogen receptor beta
Name:Estrogen receptor beta
Type:Protein
Mol. Mass.:59238.43
Organism:Homo sapiens (Human)
Description:Q92731
Residue:530
BDBM50138886
NameBDBM50138886
Synonyms:2,4-diisobutylamino-6-isopentylpyrimidine N*2*,N*4*-Diisobutyl-6-(3-methyl-butyl)-pyrimidine-2,4-diamine
TypeSmall organic molecule
Emp. Form.C17H32N4
Mol. Mass.292.4628
SMILESCC(C)CCc1cc(NCC(C)C)nc(NCC(C)C)n1