Reaction Details
TargetMatrix metalloproteinase-14
LigandBDBM50265078
Substrate/Competitorn/a
Meas. Tech.ChEMBL_497410 (CHEMBL1002951)
Ki 140±n/a nM
Citation Georgiadis, DYiotakis, A Specific targeting of metzincin family members with small-molecule inhibitors: progress toward a multifarious challenge. Bioorg Med Chem16:8781-94 (2008) 
 
Matrix metalloproteinase-14
Name:Matrix metalloproteinase-14
Type:Protein
Mol. Mass.:65900.19
Organism:Homo sapiens (Human)
Description:P50281
Residue:582
BDBM50265078
NameBDBM50265078
Synonyms:(4S)-5-amino-4-((2S)-2-((2S)-3-((4-bromophenyl)(hydroxy)phosphoryl)-2-((3-(3'-chlorobiphenyl-4-yl)isoxazol-5-yl)methyl)propanamido)-4-carboxybutanamido)-5-oxopentanoic acid | CHEMBL507420
TypeSmall organic molecule
Emp. Form.C35H35BrClN4O10P
Mol. Mass.818.004
SMILESNC(=O)[C@H](CCC(O)=O)NC(=O)[C@H](CCC(O)=O)NC(=O)[C@H](Cc1cc(no1)-c1ccc(cc1)-c1cccc(Cl)c1)CP(O)(=O)c1ccc(Br)cc1