Reaction Details
TargetMatrilysin
LigandBDBM50104975
Substrate/Competitorn/a
Meas. Tech.ChEMBL_497407 (CHEMBL1002948)
Ki 834±n/a nM
Citation Georgiadis, DYiotakis, A Specific targeting of metzincin family members with small-molecule inhibitors: progress toward a multifarious challenge. Bioorg Med Chem16:8781-94 (2008) 
 
Matrilysin
Name:Matrilysin
Type:Enzyme
Mol. Mass.:29681.54
Organism:Homo sapiens (Human)
Description:P09237
Residue:267
BDBM50104975
NameBDBM50104975
Synonyms:(8S,11R,12S)-2,10-Dioxo-11-(2'-trifluoromethyl-biphenyl-4-ylmethyl)-1-oxa-3,9-diaza-cyclopentadecane-8,12-dicarboxylic acid 12-hydroxyamide 8-[(2-morpholin-4-yl-2-oxo-ethyl)-amide] 2,10-Dioxo-11-(2'-trifluoromethyl-biphenyl-4-ylmethyl)-1-oxa-3,9-diaza-cyclopentadecane-8,12-dicarboxylic acid 12-hydroxyamide 8-[(2-morpholin-4-yl-2-oxo-ethyl)-amide] | CHEMBL325163
TypeSmall organic molecule
Emp. Form.C34H42F3N5O8
Mol. Mass.705.7212
SMILESONC(=O)[C@H]1CCCOC(=O)NCCCC[C@H](NC(=O)[C@@H]1Cc1ccc(cc1)-c1ccccc1C(F)(F)F)C(=O)NCC(=O)N1CCOCC1