Reaction Details
TargetInterstitial collagenase
LigandBDBM50216802
Substrate/Competitorn/a
Meas. Tech.ChEMBL_497402 (CHEMBL1002943)
Ki 1±n/a nM
Citation Georgiadis, DYiotakis, A Specific targeting of metzincin family members with small-molecule inhibitors: progress toward a multifarious challenge. Bioorg Med Chem16:8781-94 (2008) 
 
Interstitial collagenase
Name:Interstitial collagenase
Type:Enzyme
Mol. Mass.:54010.26
Organism:Homo sapiens (Human)
Description: P03956
Residue:469
BDBM50216802
NameBDBM50216802
Synonyms:(3R)-6-cyclohexyl-N-hydroxy-3-(3-{[(methylsulfonyl)amino]-methyl}-1,2,4-oxadiazol-5-yl)hexanamide CHEMBL389020
TypeSmall organic molecule
Emp. Form.C16H28N4O5S
Mol. Mass.388.482
SMILESCS(=O)(=O)NCc1noc(n1)[C@H](CCCC1CCCCC1)CC(=O)NO