Reaction Details
TargetMatrilysin
LigandBDBM50208340
Substrate/Competitorn/a
Meas. Tech.ChEMBL_497407 (CHEMBL1002948)
Ki>636±n/a nM
Citation Georgiadis, DYiotakis, A Specific targeting of metzincin family members with small-molecule inhibitors: progress toward a multifarious challenge. Bioorg Med Chem16:8781-94 (2008) 
 
Matrilysin
Name:Matrilysin
Type:Enzyme
Mol. Mass.:29681.54
Organism:Homo sapiens (Human)
Description:P09237
Residue:267
BDBM50208340
NameBDBM50208340
Synonyms:4-((2-methylquinolin-4-yl)methoxy)-N-(2-(2-oxo-2,3-dihydro-1H-imidazole-4-carbonyl)phenyl)benzamide CHEMBL228320
TypeSmall organic molecule
Emp. Form.C28H22N4O4
Mol. Mass.478.4987
SMILESCc1cc(COc2ccc(cc2)C(=O)Nc2ccccc2C(=O)c2c[nH]c(=O)[nH]2)c2ccccc2n1