Reaction Details
TargetA disintegrin and metalloproteinase with thrombospondin motifs 1
LigandBDBM50265114
Substrate/Competitorn/a
Meas. Tech.ChEMBL_492651 (CHEMBL953080)
Ki 7800±n/a nM
Citation Georgiadis, DYiotakis, A Specific targeting of metzincin family members with small-molecule inhibitors: progress toward a multifarious challenge. Bioorg Med Chem16:8781-94 (2008) 
 
A disintegrin and metalloproteinase with thrombospondin motifs 1
Name:A disintegrin and metalloproteinase with thrombospondin motifs 1
Type:PROTEIN
Mol. Mass.:105362.16
Organism:Homo sapiens (Human)
Description:ChEMBL_860059
Residue:967
BDBM50265114
NameBDBM50265114
Synonyms:CHEMBL495502 | N-((2R,6S)-4-(2-(hydroxyamino)-2-oxoethyl)-2,6-dimethylpiperidin-4-yl)-4-((2-methylquinolin-4-yl)methoxy)benzamide
TypeSmall organic molecule
Emp. Form.C27H32N4O4
Mol. Mass.476.5674
SMILESC[C@H]1C[C@](CC(=O)NO)(C[C@@H](C)N1)NC(=O)c1ccc(OCc2cc(C)nc3ccccc23)cc1