Reaction Details
TargetStromelysin-2
LigandBDBM50265114
Substrate/Competitorn/a
Meas. Tech.ChEMBL_497443 (CHEMBL1005437)
Ki 1650±n/a nM
Citation Georgiadis, DYiotakis, A Specific targeting of metzincin family members with small-molecule inhibitors: progress toward a multifarious challenge. Bioorg Med Chem16:8781-94 (2008) 
 
Stromelysin-2
Name:Stromelysin-2
Type:Enzyme
Mol. Mass.:54143.02
Organism:Homo sapiens (Human)
Description:P09238
Residue:476
BDBM50265114
NameBDBM50265114
Synonyms:CHEMBL495502 | N-((2R,6S)-4-(2-(hydroxyamino)-2-oxoethyl)-2,6-dimethylpiperidin-4-yl)-4-((2-methylquinolin-4-yl)methoxy)benzamide
TypeSmall organic molecule
Emp. Form.C27H32N4O4
Mol. Mass.476.5674
SMILESC[C@H]1C[C@](CC(=O)NO)(C[C@@H](C)N1)NC(=O)c1ccc(OCc2cc(C)nc3ccccc23)cc1