Reaction Details
TargetA disintegrin and metalloproteinase with thrombospondin motifs 1
LigandBDBM50183715
Substrate/Competitorn/a
Meas. Tech.ChEMBL_492651 (CHEMBL953080)
Ki 7800±n/a nM
Citation Georgiadis, DYiotakis, A Specific targeting of metzincin family members with small-molecule inhibitors: progress toward a multifarious challenge. Bioorg Med Chem16:8781-94 (2008) 
 
A disintegrin and metalloproteinase with thrombospondin motifs 1
Name:A disintegrin and metalloproteinase with thrombospondin motifs 1
Type:PROTEIN
Mol. Mass.:105362.16
Organism:Homo sapiens (Human)
Description:ChEMBL_860059
Residue:967
BDBM50183715
NameBDBM50183715
Synonyms:CHEMBL207305 N-(4-(2-(hydroxyamino)-2-oxoethyl)tetrahydro-2H-pyran-4-yl)-4-((2-methylquinolin-4-yl)methoxy)benzamide
TypeSmall organic molecule
Emp. Form.C25H27N3O5
Mol. Mass.449.499
SMILESCc1cc(COc2ccc(cc2)C(=O)NC2(CC(=O)NO)CCOCC2)c2ccccc2n1