Reaction Details
TargetNeutrophil collagenase
LigandBDBM50183715
Substrate/Competitorn/a
Meas. Tech.ChEMBL_497405 (CHEMBL1002946)
Ki>3100±n/a nM
Citation Georgiadis, DYiotakis, A Specific targeting of metzincin family members with small-molecule inhibitors: progress toward a multifarious challenge. Bioorg Med Chem16:8781-94 (2008) 
 
Neutrophil collagenase
Name:Neutrophil collagenase
Type:Enzyme
Mol. Mass.:53413.48
Organism:Homo sapiens (Human)
Description:P22894
Residue:467
BDBM50183715
NameBDBM50183715
Synonyms:CHEMBL207305 N-(4-(2-(hydroxyamino)-2-oxoethyl)tetrahydro-2H-pyran-4-yl)-4-((2-methylquinolin-4-yl)methoxy)benzamide
TypeSmall organic molecule
Emp. Form.C25H27N3O5
Mol. Mass.449.499
SMILESCc1cc(COc2ccc(cc2)C(=O)NC2(CC(=O)NO)CCOCC2)c2ccccc2n1