Reaction Details
TargetSodium-dependent serotonin transporter
LigandBDBM50073436
Substrate/Competitorn/a
Meas. Tech.ChEMBL_492709 (CHEMBL938509)
Ki 0.10±n/a nM
Citation Mavel, SVercouillie, JGarreau, LRaguza, TRavna, AWChalon, SGuilloteau, DEmond, P Docking study, synthesis, and in vitro evaluation of fluoro-MADAM derivatives as SERT ligands for PET imaging. Bioorg Med Chem16:9050-5 (2008) 
 
Sodium-dependent serotonin transporter
Name:Sodium-dependent serotonin transporter
Type:Multi-pass membrane protein
Mol. Mass.:70168.43
Organism:Rattus norvegicus (rat)
Description:P31652
Residue:630
BDBM50073436
NameBDBM50073436
Synonyms:(2-(2-((dimethylamino)methyl)phenylthio)-5-iodophenyl)methanol CHEMBL2314219 | [2-(2-Dimethylaminomethyl-phenylsulfanyl)-5-iodo-phenyl]-methanol
TypeSmall organic molecule
Emp. Form.C16H18INOS
Mol. Mass.399.29
SMILESCN(C)Cc1ccccc1Sc1ccc(I)cc1CO