Reaction Details
TargetAlpha-2B adrenergic receptor
LigandBDBM50263725
Substrate/Competitorn/a
Meas. Tech.ChEMBL_535910 (CHEMBL984462)
Ki 5.2±n/a nM
Citation Patel, SDHabeski, WMMin, HZhang, JRoof, RSnyder, BBora, GCampbell, BLi, CHidayetoglu, DJohnson, DSChaudhry, ACharlton, MEKablaoui, NM Identification and SAR around N-{2-[4-(2,3-dihydro-benzo[1,4]dioxin-2-ylmethyl)-[1,4]diazepan-1-yl]-ethyl}-2-phenoxy-nicotinamide, a selective alpha2C adrenergic receptor antagonist. Bioorg Med Chem Lett18:5689-93 (2008) 
 
Alpha-2B adrenergic receptor
Name:Alpha-2B adrenergic receptor
Type:Enzyme
Mol. Mass.:49964.20
Organism:Homo sapiens (Human)
Description:P18089
Residue:450
BDBM50263725
NameBDBM50263725
Synonyms:1-((2,3-dihydrobenzo[b][1,4]dioxin-2-yl)methyl)-4-((3-(2-phenoxypyridin-3-yl)-1,2,4-oxadiazol-5-yl)methyl)-1,4-diazepane | CHEMBL491420
TypeSmall organic molecule
Emp. Form.C28H29N5O4
Mol. Mass.499.561
SMILESC(C1COc2ccccc2O1)N1CCCN(Cc2nc(no2)-c2cccnc2Oc2ccccc2)CC1