Reaction Details
TargetAlpha-2C adrenergic receptor
LigandBDBM50263724
Substrate/Competitorn/a
Meas. Tech.ChEMBL_535909 (CHEMBL983550)
Ki 6.8±n/a nM
Citation Patel, SDHabeski, WMMin, HZhang, JRoof, RSnyder, BBora, GCampbell, BLi, CHidayetoglu, DJohnson, DSChaudhry, ACharlton, MEKablaoui, NM Identification and SAR around N-{2-[4-(2,3-dihydro-benzo[1,4]dioxin-2-ylmethyl)-[1,4]diazepan-1-yl]-ethyl}-2-phenoxy-nicotinamide, a selective alpha2C adrenergic receptor antagonist. Bioorg Med Chem Lett18:5689-93 (2008) 
 
Alpha-2C adrenergic receptor
Name:Alpha-2C adrenergic receptor
Type:Enzyme
Mol. Mass.:49552.32
Organism:Homo sapiens (Human)
Description:P18825
Residue:462
BDBM50263724
NameBDBM50263724
Synonyms:1-((2,3-dihydrobenzo[b][1,4]dioxin-2-yl)methyl)-4-(2-((2-phenoxypyridin-3-yl)methoxy)ethyl)-1,4-diazepane | CHEMBL491419
TypeSmall organic molecule
Emp. Form.C28H33N3O4
Mol. Mass.475.5793
SMILESC(CN1CCCN(CC2COc3ccccc3O2)CC1)OCc1cccnc1Oc1ccccc1