Reaction Details
TargetAlpha-2B adrenergic receptor
LigandBDBM50263672
Substrate/Competitorn/a
Meas. Tech.ChEMBL_535907 (CHEMBL983548)
Ki 11±n/a nM
Citation Patel, SDHabeski, WMMin, HZhang, JRoof, RSnyder, BBora, GCampbell, BLi, CHidayetoglu, DJohnson, DSChaudhry, ACharlton, MEKablaoui, NM Identification and SAR around N-{2-[4-(2,3-dihydro-benzo[1,4]dioxin-2-ylmethyl)-[1,4]diazepan-1-yl]-ethyl}-2-phenoxy-nicotinamide, a selective alpha2C adrenergic receptor antagonist. Bioorg Med Chem Lett18:5689-93 (2008) 
 
Alpha-2B adrenergic receptor
Name:Alpha-2B adrenergic receptor
Type:Enzyme
Mol. Mass.:49964.20
Organism:Homo sapiens (Human)
Description:P18089
Residue:450
BDBM50263672
NameBDBM50263672
Synonyms:2-butoxy-N-(2-(4-((2,3-dihydrobenzo[b][1,4]dioxin-2-yl)methyl)-1,4-diazepan-1-yl)ethyl)nicotinamide | CHEMBL514837
TypeSmall organic molecule
Emp. Form.C26H36N4O4
Mol. Mass.468.5884
SMILESCCCCOc1ncccc1C(=O)NCCN1CCCN(CC2COc3ccccc3O2)CC1