Reaction Details
TargetAlpha-2C adrenergic receptor
LigandBDBM50263674
Substrate/Competitorn/a
Meas. Tech.ChEMBL_535906 (CHEMBL983547)
Ki 16±n/a nM
Citation Patel, SDHabeski, WMMin, HZhang, JRoof, RSnyder, BBora, GCampbell, BLi, CHidayetoglu, DJohnson, DSChaudhry, ACharlton, MEKablaoui, NM Identification and SAR around N-{2-[4-(2,3-dihydro-benzo[1,4]dioxin-2-ylmethyl)-[1,4]diazepan-1-yl]-ethyl}-2-phenoxy-nicotinamide, a selective alpha2C adrenergic receptor antagonist. Bioorg Med Chem Lett18:5689-93 (2008) 
 
Alpha-2C adrenergic receptor
Name:Alpha-2C adrenergic receptor
Type:Enzyme
Mol. Mass.:49552.32
Organism:Homo sapiens (Human)
Description:P18825
Residue:462
BDBM50263674
NameBDBM50263674
Synonyms:CHEMBL476774 | N-(2-(4-((2,3-dihydrobenzo[b][1,4]dioxin-2-yl)methyl)-1,4-diazepan-1-yl)ethyl)nicotinamide
TypeSmall organic molecule
Emp. Form.C22H28N4O3
Mol. Mass.396.4827
SMILESO=C(NCCN1CCCN(CC2COc3ccccc3O2)CC1)c1cccnc1