Reaction Details
TargetAlpha-2C adrenergic receptor
LigandBDBM50263775
Substrate/Competitorn/a
Meas. Tech.ChEMBL_535906 (CHEMBL983547)
Ki 9.2±n/a nM
Citation Patel, SDHabeski, WMMin, HZhang, JRoof, RSnyder, BBora, GCampbell, BLi, CHidayetoglu, DJohnson, DSChaudhry, ACharlton, MEKablaoui, NM Identification and SAR around N-{2-[4-(2,3-dihydro-benzo[1,4]dioxin-2-ylmethyl)-[1,4]diazepan-1-yl]-ethyl}-2-phenoxy-nicotinamide, a selective alpha2C adrenergic receptor antagonist. Bioorg Med Chem Lett18:5689-93 (2008) 
 
Alpha-2C adrenergic receptor
Name:Alpha-2C adrenergic receptor
Type:Enzyme
Mol. Mass.:49552.32
Organism:Homo sapiens (Human)
Description:P18825
Residue:462
BDBM50263775
NameBDBM50263775
Synonyms:(R)-N-(2-(4-((2,3-dihydrobenzo[b][1,4]dioxin-2-yl)methyl)-1,4-diazepan-1-yl)ethyl)-2-phenoxynicotinamide | CHEMBL488974
TypeSmall organic molecule
Emp. Form.C28H32N4O4
Mol. Mass.488.5781
SMILESO=C(NCCN1CCCN(C[C@@H]2COc3ccccc3O2)CC1)c1cccnc1Oc1ccccc1