Reaction Details
TargetCasein kinase I isoform alpha
LigandBDBM50008516
Substrate/Competitorn/a
Meas. Tech.ChEMBL_535969 (CHEMBL987143)
IC50 1240±n/a nM
Citation Cozza, GGianoncelli, AMontopoli, MCaparrotta, LVenerando, AMeggio, FPinna, LAZagotto, GMoro, S Identification of novel protein kinase CK1 delta (CK1delta) inhibitors through structure-based virtual screening. Bioorg Med Chem Lett18:5672-5 (2008) 
 
Casein kinase I isoform alpha
Name:Casein kinase I isoform alpha
Type:Serine/threonine-protein kinase
Mol. Mass.:38936.59
Organism:Homo sapiens (Human)
Description:P48729
Residue:337
BDBM50008516
NameBDBM50008516
Synonyms:IC261
TypeSmall organic molecule
Emp. Form.C18H17NO4
Mol. Mass.311.3319
SMILESCOc1cc(OC)c(C=C2C(O)=Nc3ccccc23)c(OC)c1