Reaction Details
TargetHomeodomain-interacting protein kinase 2
LigandBDBM50094895
Substrate/Competitorn/a
Meas. Tech.ChEMBL_535970 (CHEMBL987144)
IC50 3300±n/a nM
Citation Cozza, GGianoncelli, AMontopoli, MCaparrotta, LVenerando, AMeggio, FPinna, LAZagotto, GMoro, S Identification of novel protein kinase CK1 delta (CK1delta) inhibitors through structure-based virtual screening. Bioorg Med Chem Lett18:5672-5 (2008) 
 
Homeodomain-interacting protein kinase 2
Name:Homeodomain-interacting protein kinase 2
Type:Protein
Mol. Mass.:131001.90
Organism:Homo sapiens (Human)
Description:Q9H2X6
Residue:1198
BDBM50094895
NameBDBM50094895
Synonyms:1,4-diamino-9,10-anthraquinone 1,4-diaminoanthracene-9,10-dione | CHEMBL86771
TypeSmall organic molecule
Emp. Form.C14H10N2O2
Mol. Mass.238.2414
SMILESNc1ccc(N)c2C(=O)c3ccccc3C(=O)c12