Reaction Details
TargetPurine nucleoside phosphorylase
LigandBDBM50252865
Substrate/Competitorn/a
Meas. Tech.ChEMBL_534715 (CHEMBL982804)
Ki 3.6±n/a nM
Citation Mason, JMMurkin, ASLi, LSchramm, VLGainsford, GJSkelton, BW A beta-fluoroamine inhibitor of purine nucleoside phosphorylase. J Med Chem51:5880-4 (2008) 
 
Purine nucleoside phosphorylase
Name:Purine nucleoside phosphorylase
Type:Enzyme
Mol. Mass.:26857.85
Organism:Plasmodium falciparum
Description:n/a
Residue:245
BDBM50252865
NameBDBM50252865
Synonyms:(+/-)-cis-1-((9-Deazahypoxanthin-9-yl)methyl)-4-fluoro-4-hydroxymethylpyrrolidin-3-ol CHEMBL498940 | Immucillins, 1
TypeSmall organic molecule
Emp. Form.C12H15FN4O3
Mol. Mass.282.2709
SMILESOC[C@@]1(F)CN(Cc2c[nH]c3c2nc[nH]c3=O)C[C@@H]1O