Reaction Details
TargetRibonuclease pancreatic
LigandBDBM50276039
Substrate/Competitorn/a
Meas. Tech.ChEMBL_496860 (CHEMBL998529)
Ki 103000±n/a nM
Citation Ghosh, KSDebnath, JPathak, TDasgupta, S Using proton nuclear magnetic resonance to study the mode of ribonuclease A inhibition by competitive and noncompetitive inhibitors. Bioorg Med Chem Lett18:5503-6 (2008) 
 
Ribonuclease pancreatic
Name:Ribonuclease pancreatic
Type:Protein
Mol. Mass.:17653.66
Organism:Homo sapiens (Human)
Description:n/a
Residue:156
BDBM50276039
NameBDBM50276039
Synonyms:1-[3-(4-CARBOXYPIPERIDIN-1-YL)-3-DEOXY-BETA-D-ARABINOFURANOSYL]PYRIMIDINE-2,4(1H,3H)-DIONE CHEMBL469949
TypeSmall organic molecule
Emp. Form.C15H21N3O7
Mol. Mass.355.3431
SMILESOC[C@H]1O[C@H]([C@@H](O)[C@@H]1N1CCC(CC1)C(O)=O)n1ccc(=O)[nH]c1=O