Reaction Details
TargetCyclin-dependent kinase 2
LigandBDBM7674
Substrate/Competitorn/a
Meas. Tech.ChEMBL_536407 (CHEMBL992478)
IC50 8±n/a nM
Citation Anderson, MAndrews, DMBarker, AJBrassington, CABreed, JByth, KFCulshaw, JDFinlay, MRFisher, EMcMiken, HHGreen, CPHeaton, DWNash, IANewcombe, NJOakes, SEPauptit, RARoberts, AStanway, JJThomas, APTucker, JAWalker, MWeir, HM Imidazoles: SAR and development of a potent class of cyclin-dependent kinase inhibitors. Bioorg Med Chem Lett18:5487-92 (2008) 
 
Cyclin-dependent kinase 2
Name:Cyclin-dependent kinase 2
Type:Enzyme Subunit
Mol. Mass.:33938.17
Organism:Homo sapiens (Human)
Description:P24941
Residue:298
BDBM7674
NameBDBM7674
Synonyms:CHEMBL484571 N-[2-(dimethylamino)ethyl]-4-[(4-{imidazo[1,2-a]pyridazin-3-yl}pyrimidin-2-yl)amino]benzene-1-sulfonamide
TypeSmall organic molecule
Emp. Form.C20H22N8O2S
Mol. Mass.438.506
SMILESCN(C)CCNS(=O)(=O)c1ccc(Nc2nccc(n2)-c2cnc3cccnn23)cc1