Reaction Details
TargetCyclin-dependent kinase 2
LigandBDBM50274664
Substrate/Competitorn/a
Meas. Tech.ChEMBL_536407 (CHEMBL992478)
IC50 400±n/a nM
Citation Anderson, MAndrews, DMBarker, AJBrassington, CABreed, JByth, KFCulshaw, JDFinlay, MRFisher, EMcMiken, HHGreen, CPHeaton, DWNash, IANewcombe, NJOakes, SEPauptit, RARoberts, AStanway, JJThomas, APTucker, JAWalker, MWeir, HM Imidazoles: SAR and development of a potent class of cyclin-dependent kinase inhibitors. Bioorg Med Chem Lett18:5487-92 (2008) 
 
Cyclin-dependent kinase 2
Name:Cyclin-dependent kinase 2
Type:Enzyme Subunit
Mol. Mass.:33938.17
Organism:Homo sapiens (Human)
Description:P24941
Residue:298
BDBM50274664
NameBDBM50274664
Synonyms:4-(4-(1,2-dimethyl-1H-imidazol-5-yl)pyrimidin-2-ylamino)-N-(2-methoxyethyl)-N-methylbenzenesulfonamide | CHEMBL485602
TypeSmall organic molecule
Emp. Form.C19H24N6O3S
Mol. Mass.416.497
SMILESCOCCN(C)S(=O)(=O)c1ccc(Nc2nccc(n2)-c2cnc(C)n2C)cc1