Reaction Details
TargetCyclin-dependent kinase 4
LigandBDBM50274805
Substrate/Competitorn/a
Meas. Tech.ChEMBL_536408 (CHEMBL992479)
IC50 490±n/a nM
Citation Anderson, MAndrews, DMBarker, AJBrassington, CABreed, JByth, KFCulshaw, JDFinlay, MRFisher, EMcMiken, HHGreen, CPHeaton, DWNash, IANewcombe, NJOakes, SEPauptit, RARoberts, AStanway, JJThomas, APTucker, JAWalker, MWeir, HM Imidazoles: SAR and development of a potent class of cyclin-dependent kinase inhibitors. Bioorg Med Chem Lett18:5487-92 (2008) 
 
Cyclin-dependent kinase 4
Name:Cyclin-dependent kinase 4
Type:Enzyme Subunit
Mol. Mass.:33731.96
Organism:Homo sapiens (Human)
Description:P11802
Residue:303
BDBM50274805
NameBDBM50274805
Synonyms:4-(1-isopropyl-2-methyl-1H-imidazol-5-yl)-N-(4-(2-methoxyethylsulfonyl)phenyl)pyrimidin-2-amine | CHEMBL515854
TypeSmall organic molecule
Emp. Form.C20H25N5O3S
Mol. Mass.415.509
SMILESCOCCS(=O)(=O)c1ccc(Nc2nccc(n2)-c2cnc(C)n2C(C)C)cc1