Reaction Details
TargetSigma non-opioid intracellular receptor 1
LigandBDBM50252763
Substrate/Competitorn/a
Meas. Tech.ChEMBL_539504 (CHEMBL1032313)
Ki 1.6±n/a nM
Citation Oberdorf, CSchepmann, DVela, JMDiaz, JLHolenz, JWünsch, B Thiophene bioisosteres of spirocyclic sigma receptor ligands. 1. N-substituted spiro[piperidine-4,4'-thieno[3,2-c]pyrans]. J Med Chem51:6531-7 (2008) 
 
Sigma non-opioid intracellular receptor 1
Name:Sigma non-opioid intracellular receptor 1
Type:Protein
Mol. Mass.:25307.17
Organism:Cavia porcellus (Guinea pig)
Description:Q60492
Residue:223
BDBM50252763
NameBDBM50252763
Synonyms:6-Methoxy-1-pentyl-6,7-dihydrospiro[piperidine-4,4-thieno[3.2-c]pyran] | CHEMBL495071
TypeSmall organic molecule
Emp. Form.C17H27NO2S
Mol. Mass.309.467
SMILESCCCCCN1CCC2(CC1)OC(Cc1sccc21)OC