Reaction Details
TargetSigma non-opioid intracellular receptor 1
LigandBDBM50252758
Substrate/Competitorn/a
Meas. Tech.ChEMBL_539504 (CHEMBL1032313)
Ki 2.2±n/a nM
Citation Oberdorf, CSchepmann, DVela, JMDiaz, JLHolenz, JWünsch, B Thiophene bioisosteres of spirocyclic sigma receptor ligands. 1. N-substituted spiro[piperidine-4,4'-thieno[3,2-c]pyrans]. J Med Chem51:6531-7 (2008) 
 
Sigma non-opioid intracellular receptor 1
Name:Sigma non-opioid intracellular receptor 1
Type:Protein
Mol. Mass.:25307.17
Organism:Cavia porcellus (Guinea pig)
Description:Q60492
Residue:223
BDBM50252758
NameBDBM50252758
Synonyms:3'-methoxy-1-[(4-methoxyphenyl)methyl]-3',4'-dihydrospiro[piperidine-4,1'-thieno[3,2-c]pyran] | CHEMBL492249
TypeSmall organic molecule
Emp. Form.C20H25NO3S
Mol. Mass.359.482
SMILESCOC1Cc2sccc2C2(CCN(Cc3ccc(OC)cc3)CC2)O1