Reaction Details
TargetCytochrome P450 3A4
LigandBDBM50253101
Substrate/Competitorn/a
Meas. Tech.ChEMBL_539794 (CHEMBL1035787)
IC50>25000±n/a nM
Citation Pettus, LHXu, SCao, GQChakrabarti, PPRzasa, RMSham, KWurz, RPZhang, DMiddleton, SHenkle, BPlant, MHSaris, CJSherman, LWong, LMPowers, DATudor, YYu, VLee, MRSyed, RHsieh, FTasker, AS 3-amino-7-phthalazinylbenzoisoxazoles as a novel class of potent, selective, and orally available inhibitors of p38alpha mitogen-activated protein kinase. J Med Chem51:6280-92 (2008) 
 
Cytochrome P450 3A4
Name:Cytochrome P450 3A4
Type:Enzyme
Mol. Mass.:57349.57
Organism:Homo sapiens (Human)
Description:n/a
Residue:503
BDBM50253101
NameBDBM50253101
Synonyms:7-(1-Isopropylphthalazin-6-yl)-N,6-dimethylbenzo[d]isoxazol-3-amine | CHEMBL492661
TypeSmall organic molecule
Emp. Form.C20H20N4O
Mol. Mass.332.399
SMILESCNc1noc2c(c(C)ccc12)-c1ccc2c(nncc2c1)C(C)C