Reaction Details
TargetCytochrome P450 3A4
LigandBDBM50253148
Substrate/Competitorn/a
Meas. Tech.ChEMBL_539794 (CHEMBL1035787)
IC50>25000±n/a nM
Citation Pettus, LHXu, SCao, GQChakrabarti, PPRzasa, RMSham, KWurz, RPZhang, DMiddleton, SHenkle, BPlant, MHSaris, CJSherman, LWong, LMPowers, DATudor, YYu, VLee, MRSyed, RHsieh, FTasker, AS 3-amino-7-phthalazinylbenzoisoxazoles as a novel class of potent, selective, and orally available inhibitors of p38alpha mitogen-activated protein kinase. J Med Chem51:6280-92 (2008) 
 
Cytochrome P450 3A4
Name:Cytochrome P450 3A4
Type:Enzyme
Mol. Mass.:57349.57
Organism:Homo sapiens (Human)
Description:n/a
Residue:503
BDBM50253148
NameBDBM50253148
Synonyms:CHEMBL522689 | N-(S)-sec-Butyl-6-(6-methyl-3-(methylamino)benzo[d]isoxazol-7-yl)phthalazin-1-amine
TypeSmall organic molecule
Emp. Form.C21H23N5O
Mol. Mass.361.4402
SMILESCC[C@H](C)Nc1nncc2cc(ccc12)-c1c(C)ccc2c(NC)noc12