Reaction Details
TargetMitogen-activated protein kinase 14
LigandBDBM50252774
Substrate/Competitorn/a
Meas. Tech.ChEMBL_539791 (CHEMBL1035784)
Ki 0.8±n/a nM
Citation Pettus, LHXu, SCao, GQChakrabarti, PPRzasa, RMSham, KWurz, RPZhang, DMiddleton, SHenkle, BPlant, MHSaris, CJSherman, LWong, LMPowers, DATudor, YYu, VLee, MRSyed, RHsieh, FTasker, AS 3-amino-7-phthalazinylbenzoisoxazoles as a novel class of potent, selective, and orally available inhibitors of p38alpha mitogen-activated protein kinase. J Med Chem51:6280-92 (2008) 
 
Mitogen-activated protein kinase 14
Name:Mitogen-activated protein kinase 14
Type:Serine/threonine-protein kinase
Mol. Mass.:41286.76
Organism:Homo sapiens (Human)
Description:Q16539
Residue:360
BDBM50252774
NameBDBM50252774
Synonyms:1-((S)-4-(6-(3-(Cyclopropylamino)-6-methylbenzo[d]isoxazol-7-yl)phthalazin-1-yl)-3-methylpiperazin-1-yl)ethanone | CHEMBL495290
TypeSmall organic molecule
Emp. Form.C26H28N6O2
Mol. Mass.456.5395
SMILESC[C@H]1CN(CCN1c1nncc2cc(ccc12)-c1c(C)ccc2c(NC3CC3)noc12)C(C)=O