Reaction Details
TargetMitogen-activated protein kinase 14
LigandBDBM50252781
Substrate/Competitorn/a
Meas. Tech.ChEMBL_539857 (CHEMBL1024853)
IC50 0.6±n/a nM
Citation Herberich, BCao, GQChakrabarti, PPFalsey, JRPettus, LRzasa, RMReed, ABReichelt, ASham, KThaman, MWurz, RPXu, SZhang, DHsieh, FLee, MRSyed, RLi, VGrosfeld, DPlant, MHHenkle, BSherman, LMiddleton, SWong, LMTasker, AS Discovery of highly selective and potent p38 inhibitors based on a phthalazine scaffold. J Med Chem51:6271-9 (2008) 
 
Mitogen-activated protein kinase 14
Name:Mitogen-activated protein kinase 14
Type:Serine/threonine-protein kinase
Mol. Mass.:41286.76
Organism:Homo sapiens (Human)
Description:Q16539
Residue:360
BDBM50252781
NameBDBM50252781
Synonyms:CHEMBL493670 | N-Cyclopropyl-4-methyl-3-(1-(1-methylethoxy)-6-phthalazinyl)benzamide
TypeSmall organic molecule
Emp. Form.C22H23N3O2
Mol. Mass.361.4369
SMILESCC(C)Oc1nncc2cc(ccc12)-c1cc(ccc1C)C(=O)NC1CC1