Reaction Details
TargetMitogen-activated protein kinase 14
LigandBDBM50252779
Substrate/Competitorn/a
Meas. Tech.ChEMBL_539857 (CHEMBL1024853)
IC50 1.1±n/a nM
Citation Herberich, BCao, GQChakrabarti, PPFalsey, JRPettus, LRzasa, RMReed, ABReichelt, ASham, KThaman, MWurz, RPXu, SZhang, DHsieh, FLee, MRSyed, RLi, VGrosfeld, DPlant, MHHenkle, BSherman, LMiddleton, SWong, LMTasker, AS Discovery of highly selective and potent p38 inhibitors based on a phthalazine scaffold. J Med Chem51:6271-9 (2008) 
 
Mitogen-activated protein kinase 14
Name:Mitogen-activated protein kinase 14
Type:Serine/threonine-protein kinase
Mol. Mass.:41286.76
Organism:Homo sapiens (Human)
Description:Q16539
Residue:360
BDBM50252779
NameBDBM50252779
Synonyms:CHEMBL494469 | N-Cyclopropyl-4-methyl-3-(1-((3S)-3-methyl-4-morpholinyl)-6-phthalazinyl)benzamide
TypeSmall organic molecule
Emp. Form.C24H26N4O2
Mol. Mass.402.4888
SMILESC[C@H]1COCCN1c1nncc2cc(ccc12)-c1cc(ccc1C)C(=O)NC1CC1