Reaction Details
TargetMitogen-activated protein kinase 14
LigandBDBM50252778
Substrate/Competitorn/a
Meas. Tech.ChEMBL_539857 (CHEMBL1024853)
IC50 1.2±n/a nM
Citation Herberich, BCao, GQChakrabarti, PPFalsey, JRPettus, LRzasa, RMReed, ABReichelt, ASham, KThaman, MWurz, RPXu, SZhang, DHsieh, FLee, MRSyed, RLi, VGrosfeld, DPlant, MHHenkle, BSherman, LMiddleton, SWong, LMTasker, AS Discovery of highly selective and potent p38 inhibitors based on a phthalazine scaffold. J Med Chem51:6271-9 (2008) 
 
Mitogen-activated protein kinase 14
Name:Mitogen-activated protein kinase 14
Type:Serine/threonine-protein kinase
Mol. Mass.:41286.76
Organism:Homo sapiens (Human)
Description:Q16539
Residue:360
BDBM50252778
NameBDBM50252778
Synonyms:CHEMBL494272 | N-Cyclopropyl-4-methyl-3-(1-(4-morpholino)-6-phthalazinyl)-benzamide
TypeSmall organic molecule
Emp. Form.C23H24N4O2
Mol. Mass.388.4623
SMILESCc1ccc(cc1-c1ccc2c(nncc2c1)N1CCOCC1)C(=O)NC1CC1