Reaction Details
TargetVoltage-dependent T-type calcium channel subunit alpha-1I
LigandBDBM50240424
Substrate/Competitorn/a
Meas. Tech.ChEMBL_538845 (CHEMBL1033088)
IC50>5000000±n/a nM
Citation Yang, ZQBarrow, JCShipe, WDSchlegel, KAShu, YYang, FVLindsley, CWRittle, KEBock, MGHartman, GDUebele, VNNuss, CEFox, SVKraus, RLDoran, SMConnolly, TMTang, CBallard, JEKuo, YAdarayan, EDPrueksaritanont, TZrada, MMMarino, MJGraufelds, VKDiLella, AGReynolds, IJVargas, HMBunting, PBWoltmann, RFMagee, MMKoblan, KSRenger, JJ Discovery of 1,4-substituted piperidines as potent and selective inhibitors of T-type calcium channels. J Med Chem51:6471-7 (2008) 
 
Voltage-dependent T-type calcium channel subunit alpha-1I
Name:Voltage-dependent T-type calcium channel subunit alpha-1I
Type:PROTEIN
Mol. Mass.:245101.25
Organism:Homo sapiens (Human)
Description:ChEMBL_538845
Residue:2223
BDBM50240424
NameBDBM50240424
Synonyms:3-Ethyl-3-methyl-pyrrolidine-2,5-dione 3-Ethyl-3-methyl-pyrrolidine-2,5-dione(ethosuximide) CHEMBL696 CN-10395 PM-671 zarontin3-Ethyl-3-methyl-pyrrolidine-2,5-dione
TypeSmall organic molecule
Emp. Form.C7H11NO2
Mol. Mass.141.1677
SMILESCCC1(C)CC(=O)NC1=O